{"text_format":"1","workbook":"xlsx","n_sheets":5,"sheets":["Tabelle1","PLC24","CB32","VLC","Step by step guide"],"not_rendered":{"charts":0,"images":1,"macros":1,"external_links":0,"defined_names":2,"comments":0,"pivot_tables":0},"unopened":[],"bounds":{"document_bytes":16777216,"sheet_cells":100000,"rows_first":2000,"rows_last":500,"rows_between":2000,"halvings":0,"cell_chars":16384,"cell_head_chars":4096},"cells_cut":0,"cells_raw":0,"read":"whole","date_system":"1900"}

{"sheet":"Tabelle1","index":0,"n_rows":0,"n_cols":0,"rows_kept":0,"cut":false,"hidden":true,"merged":[]}

{"sheet":"PLC24","index":1,"n_rows":389,"n_cols":13,"rows_kept":389,"cut":false,"hidden":false,"merged":[[367,5,367,6],[367,7,367,8],[367,9,367,10],[367,0,368,0],[367,1,368,1],[367,2,368,2],[367,3,368,3],[367,4,368,4],[319,5,319,6],[319,7,319,8],[319,9,319,10],[343,0,344,0],[343,1,344,1],[343,2,344,2],[343,3,344,3],[343,4,344,4],[343,5,343,6],[343,7,343,8],[343,9,343,10],[319,0,320,0],[319,1,320,1],[319,2,320,2],[319,3,320,3],[319,4,320,4],[271,5,271,6],[271,7,271,8],[271,9,271,10],[295,0,296,0],[295,1,296,1],[295,2,296,2],[295,3,296,3],[295,4,296,4],[295,5,295,6],[295,7,295,8],[295,9,295,10],[271,0,272,0],[271,1,272,1],[271,2,272,2],[271,3,272,3],[271,4,272,4],[294,1,294,3],[223,5,223,6],[223,7,223,8],[223,9,223,10],[247,0,248,0],[247,1,248,1],[247,2,248,2],[247,3,248,3],[247,4,248,4],[247,5,247,6],[247,7,247,8],[247,9,247,10],[223,0,224,0],[223,1,224,1],[223,2,224,2],[223,3,224,3],[223,4,224,4],[245,1,245,3],[246,1,246,3],[175,5,175,6],[175,7,175,8],[175,9,175,10],[199,0,200,0],[199,1,200,1],[199,2,200,2],[199,3,200,3],[199,4,200,4],[199,5,199,6],[199,7,199,8],[199,9,199,10],[175,0,176,0],[175,1,176,1],[175,2,176,2],[175,3,176,3],[175,4,176,4],[198,1,198,3],[197,1,197,3],[127,5,127,6],[127,7,127,8],[127,9,127,10],[151,0,152,0],[151,1,152,1],[151,2,152,2],[151,3,152,3],[151,4,152,4],[151,5,151,6],[151,7,151,8],[151,9,151,10],[127,0,128,0],[127,1,128,1],[127,2,128,2],[127,3,128,3],[127,4,128,4],[150,1,150,3],[79,5,79,6],[79,7,79,8],[79,9,79,10],[103,0,104,0],[103,1,104,1],[103,2,104,2],[103,3,104,3],[103,4,104,4],[103,5,103,6],[103,7,103,8],[103,9,103,10],[79,0,80,0],[79,1,80,1],[79,2,80,2],[79,3,80,3],[79,4,80,4],[102,1,102,3],[31,5,31,6],[31,7,31,8],[31,9,31,10],[55,0,56,0],[55,1,56,1],[55,2,56,2],[55,3,56,3],[55,4,56,4],[55,5,55,6],[55,7,55,8],[55,9,55,10],[31,0,32,0],[31,1,32,1],[31,2,32,2],[31,3,32,3],[31,4,32,4],[54,1,54,3],[0,5,0,8],[1,5,1,8],[2,5,2,8],[7,0,8,0],[7,5,7,6],[7,7,7,8],[7,9,7,10],[7,1,8,1],[7,2,8,2],[7,3,8,3],[7,4,8,4],[5,1,5,3],[6,1,6,3],[0,1,0,2],[29,1,29,3],[53,1,53,3],[77,1,77,3],[101,1,101,3],[125,1,125,3],[30,1,30,3],[78,1,78,3],[149,1,149,3],[173,1,173,3],[366,1,366,3],[221,1,221,3],[126,1,126,3],[174,1,174,3],[222,1,222,3],[269,1,269,3],[293,1,293,3],[317,1,317,3],[341,1,341,3],[365,1,365,3],[270,1,270,3],[318,1,318,3],[342,1,342,3]]}
["Bauvorhaben:",null,null,"ELEKTRO-Unternehmen : ",null,"DL… Dauerlicht"]
[null,null,null,null,null,"GL ... Geschaltetes Licht"]
[null,null,null,"verantwortlicher Monteur: ",null,"BL … Bereitschaftslicht"]
[]
[null,null,null,null,null,null,null,null,null,"Version","4.0"]
["Gerätename:",null,null,null,"PLC24 Stromkreis-Nummer: 1"]
["Stromkreis-Bezeichnung:"]
["Stromkreisbelegung","ID 1","ID 2","Bezeichnung","Zusatzinfo","DL",null,"GL",null,"BL"]
[null,null,null,null,null,"ID1","ID2","ID1","ID2","ID1","ID2"]
["SK Teilnehmer 1",{"$f":"_xlfn.IFNA(INDEX(VLC!A:A,MATCH(101,VLC!V:V,0)),\"\")","v":""},{"$f":"_xlfn.IFNA(INDEX(VLC!A:A,MATCH(141,VLC!V:V,0)),\"\")","v":""},{"$f":"_xlfn.IFNA(INDEX(VLC!B:B,MATCH(101,VLC!V:V,0)),\"\")","v":""},{"$f":"_xlfn.IFNA(INDEX(VLC!C:C,MATCH(101,VLC!V:V,0)),\"\")","v":""},{"$f":"_xlfn.IFNA(IF(INDEX(VLC!H:H,MATCH(101,VLC!V:V,0))=\"x\",_xlfn.IFNA(INDEX(VLC!H:H,MATCH(101,VLC!V:V,0)),\"\"),\"\"),\"\")","v":""},{"$f":"_xlfn.IFNA(IF(INDEX(VLC!H:H,MATCH(141,VLC!V:V,0))=\"x\",_xlfn.IFNA(INDEX(VLC!H:H,MATCH(141,VLC!V:V,0)),\"\"),\"\"),\"\")","v":""},{"$f":"_xlfn.IFNA(IF(INDEX(VLC!I:I,MATCH(101,VLC!V:V,0))<>\"\",_xlfn.IFNA(INDEX(VLC!I:I,MATCH(101,VLC!V:V,0)),\"\"),\"\"),\"\")","v":""},{"$f":"_xlfn.IFNA(IF(INDEX(VLC!I:I,MATCH(141,VLC!V:V,0))<>\"\",_xlfn.IFNA(INDEX(VLC!I:I,MATCH(141,VLC!V:V,0)),\"\"),\"\"),\"\")","v":""},{"$f":"_xlfn.IFNA(IF(INDEX(VLC!J:J,MATCH(101,VLC!V:V,0))=\"x\",_xlfn.IFNA(INDEX(VLC!J:J,MATCH(101,VLC!V:V,0)),\"\"),\"\"),\"\")","v":""},{"$f":"_xlfn.IFNA(IF(INDEX(VLC!J:J,MATCH(141,VLC!V:V,0))=\"x\",_xlfn.IFNA(INDEX(VLC!J:J,MATCH(141,VLC!V:V,0)),\"\"),\"\"),\"\")","v":""},{"$f":"1000+ROW(A10)-9","v":1001},{"$f":"L10+40","v":1041}]
["SK Teilnehmer 2",{"$f":"_xlfn.IFNA(INDEX(VLC!A:A,MATCH(102,VLC!V:V,0)),\"\")","v":""},{"$f":"_xlfn.IFNA(INDEX(VLC!A:A,MATCH(142,VLC!V:V,0)),\"\")","v":""},{"$f":"_xlfn.IFNA(INDEX(VLC!B:B,MATCH(102,VLC!V:V,0)),\"\")","v":""},{"$f":"_xlfn.IFNA(INDEX(VLC!C:C,MATCH(102,VLC!V:V,0)),\"\")","v":""},{"$f":"_xlfn.IFNA(IF(INDEX(VLC!H:H,MATCH(102,VLC!V:V,0))=\"x\",_xlfn.IFNA(INDEX(VLC!H:H,MATCH(102,VLC!V:V,0)),\"\"),\"\"),\"\")","v":""},{"$f":"_xlfn.IFNA(IF(INDEX(VLC!H:H,MATCH(142,VLC!V:V,0))=\"x\",_xlfn.IFNA(INDEX(VLC!H:H,MATCH(142,VLC!V:V,0)),\"\"),\"\"),\"\")","v":""},{"$f":"_xlfn.IFNA(IF(INDEX(VLC!I:I,MATCH(102,VLC!V:V,0))<>\"\",_xlfn.IFNA(INDEX(VLC!I:I,MATCH(102,VLC!V:V,0)),\"\"),\"\"),\"\")","v":""},{"$f":"_xlfn.IFNA(IF(INDEX(VLC!I:I,MATCH(142,VLC!V:V,0))<>\"\",_xlfn.IFNA(INDEX(VLC!I:I,MATCH(142,VLC!V:V,0)),\"\"),\"\"),\"\")","v":""},{"$f":"_xlfn.IFNA(IF(INDEX(VLC!J:J,MATCH(102,VLC!V:V,0))=\"x\",_xlfn.IFNA(INDEX(VLC!J:J,MATCH(102,VLC!V:V,0)),\"\"),\"\"),\"\")","v":""},{"$f":"_xlfn.IFNA(IF(INDEX(VLC!J:J,MATCH(142,VLC!V:V,0))=\"x\",_xlfn.IFNA(INDEX(VLC!J:J,MATCH(142,VLC!V:V,0)),\"\"),\"\"),\"\")","v":""},{"$f":"1000+ROW(A11)-9","v":1002},{"$f":"L11+40","v":1042}]
["SK Teilnehmer 3",{"$f":"_xlfn.IFNA(INDEX(VLC!A:A,MATCH(103,VLC!V:V,0)),\"\")","v":""},{"$f":"_xlfn.IFNA(INDEX(VLC!A:A,MATCH(143,VLC!V:V,0)),\"\")","v":""},{"$f":"_xlfn.IFNA(INDEX(VLC!B:B,MATCH(103,VLC!V:V,0)),\"\")","v":""},{"$f":"_xlfn.IFNA(INDEX(VLC!C:C,MATCH(103,VLC!V:V,0)),\"\")","v":""},{"$f":"_xlfn.IFNA(IF(INDEX(VLC!H:H,MATCH(103,VLC!V:V,0))=\"x\",_xlfn.IFNA(INDEX(VLC!H:H,MATCH(103,VLC!V:V,0)),\"\"),\"\"),\"\")","v":""},{"$f":"_xlfn.IFNA(IF(INDEX(VLC!H:H,MATCH(143,VLC!V:V,0))=\"x\",_xlfn.IFNA(INDEX(VLC!H:H,MATCH(143,VLC!V:V,0)),\"\"),\"\"),\"\")","v":""},{"$f":"_xlfn.IFNA(IF(INDEX(VLC!I:I,MATCH(103,VLC!V:V,0))<>\"\",_xlfn.IFNA(INDEX(VLC!I:I,MATCH(103,VLC!V:V,0)),\"\"),\"\"),\"\")","v":""},{"$f":"_xlfn.IFNA(IF(INDEX(VLC!I:I,MATCH(143,VLC!V:V,0))<>\"\",_xlfn.IFNA(INDEX(VLC!I:I,MATCH(143,VLC!V:V,0)),\"\"),\"\"),\"\")","v":""},{"$f":"_xlfn.IFNA(IF(INDEX(VLC!J:J,MATCH(103,VLC!V:V,0))=\"x\",_xlfn.IFNA(INDEX(VLC!J:J,MATCH(103,VLC!V:V,0)),\"\"),\"\"),\"\")","v":""},{"$f":"_xlfn.IFNA(IF(INDEX(VLC!J:J,MATCH(143,VLC!V:V,0))=\"x\",_xlfn.IFNA(INDEX(VLC!J:J,MATCH(143,VLC!V:V,0)),\"\"),\"\"),\"\")","v":""},1003,1043]
["SK Teilnehmer 4",{"$f":"_xlfn.IFNA(INDEX(VLC!A:A,MATCH(104,VLC!V:V,0)),\"\")","v":""},{"$f":"_xlfn.IFNA(INDEX(VLC!A:A,MATCH(144,VLC!V:V,0)),\"\")","v":""},{"$f":"_xlfn.IFNA(INDEX(VLC!B:B,MATCH(104,VLC!V:V,0)),\"\")","v":""},{"$f":"_xlfn.IFNA(INDEX(VLC!C:C,MATCH(104,VLC!V:V,0)),\"\")","v":""},{"$f":"_xlfn.IFNA(IF(INDEX(VLC!H:H,MATCH(104,VLC!V:V,0))=\"x\",_xlfn.IFNA(INDEX(VLC!H:H,MATCH(104,VLC!V:V,0)),\"\"),\"\"),\"\")","v":""},{"$f":"_xlfn.IFNA(IF(INDEX(VLC!H:H,MATCH(144,VLC!V:V,0))=\"x\",_xlfn.IFNA(INDEX(VLC!H:H,MATCH(144,VLC!V:V,0)),\"\"),\"\"),\"\")","v":""},{"$f":"_xlfn.IFNA(IF(INDEX(VLC!I:I,MATCH(104,VLC!V:V,0))<>\"\",_xlfn.IFNA(INDEX(VLC!I:I,MATCH(104,VLC!V:V,0)),\"\"),\"\"),\"\")","v":""},{"$f":"_xlfn.IFNA(IF(INDEX(VLC!I:I,MATCH(144,VLC!V:V,0))<>\"\",_xlfn.IFNA(INDEX(VLC!I:I,MATCH(144,VLC!V:V,0)),\"\"),\"\"),\"\")","v":""},{"$f":"_xlfn.IFNA(IF(INDEX(VLC!J:J,MATCH(104,VLC!V:V,0))=\"x\",_xlfn.IFNA(INDEX(VLC!J:J,MATCH(104,VLC!V:V,0)),\"\"),\"\"),\"\")","v":""},{"$f":"_xlfn.IFNA(IF(INDEX(VLC!J:J,MATCH(144,VLC!V:V,0))=\"x\",_xlfn.IFNA(INDEX(VLC!J:J,MATCH(144,VLC!V:V,0)),\"\"),\"\"),\"\")","v":""},1004,1044]
["SK Teilnehmer 5",{"$f":"_xlfn.IFNA(INDEX(VLC!A:A,MATCH(105,VLC!V:V,0)),\"\")","v":""},{"$f":"_xlfn.IFNA(INDEX(VLC!A:A,MATCH(145,VLC!V:V,0)),\"\")","v":""},{"$f":"_xlfn.IFNA(INDEX(VLC!B:B,MATCH(105,VLC!V:V,0)),\"\")","v":""},{"$f":"_xlfn.IFNA(INDEX(VLC!C:C,MATCH(105,VLC!V:V,0)),\"\")","v":""},{"$f":"_xlfn.IFNA(IF(INDEX(VLC!H:H,MATCH(105,VLC!V:V,0))=\"x\",_xlfn.IFNA(INDEX(VLC!H:H,MATCH(105,VLC!V:V,0)),\"\"),\"\"),\"\")","v":""},{"$f":"_xlfn.IFNA(IF(INDEX(VLC!H:H,MATCH(145,VLC!V:V,0))=\"x\",_xlfn.IFNA(INDEX(VLC!H:H,MATCH(145,VLC!V:V,0)),\"\"),\"\"),\"\")","v":""},{"$f":"_xlfn.IFNA(IF(INDEX(VLC!I:I,MATCH(105,VLC!V:V,0))<>\"\",_xlfn.IFNA(INDEX(VLC!I:I,MATCH(105,VLC!V:V,0)),\"\"),\"\"),\"\")","v":""},{"$f":"_xlfn.IFNA(IF(INDEX(VLC!I:I,MATCH(145,VLC!V:V,0))<>\"\",_xlfn.IFNA(INDEX(VLC!I:I,MATCH(145,VLC!V:V,0)),\"\"),\"\"),\"\")","v":""},{"$f":"_xlfn.IFNA(IF(INDEX(VLC!J:J,MATCH(105,VLC!V:V,0))=\"x\",_xlfn.IFNA(INDEX(VLC!J:J,MATCH(105,VLC!V:V,0)),\"\"),\"\"),\"\")","v":""},{"$f":"_xlfn.IFNA(IF(INDEX(VLC!J:J,MATCH(145,VLC!V:V,0))=\"x\",_xlfn.IFNA(INDEX(VLC!J:J,MATCH(145,VLC!V:V,0)),\"\"),\"\"),\"\")","v":""},1005,1045]
["SK Teilnehmer 6",{"$f":"_xlfn.IFNA(INDEX(VLC!A:A,MATCH(106,VLC!V:V,0)),\"\")","v":""},{"$f":"_xlfn.IFNA(INDEX(VLC!A:A,MATCH(146,VLC!V:V,0)),\"\")","v":""},{"$f":"_xlfn.IFNA(INDEX(VLC!B:B,MATCH(106,VLC!V:V,0)),\"\")","v":""},{"$f":"_xlfn.IFNA(INDEX(VLC!C:C,MATCH(106,VLC!V:V,0)),\"\")","v":""},{"$f":"_xlfn.IFNA(IF(INDEX(VLC!H:H,MATCH(106,VLC!V:V,0))=\"x\",_xlfn.IFNA(INDEX(VLC!H:H,MATCH(106,VLC!V:V,0)),\"\"),\"\"),\"\")","v":""},{"$f":"_xlfn.IFNA(IF(INDEX(VLC!H:H,MATCH(146,VLC!V:V,0))=\"x\",_xlfn.IFNA(INDEX(VLC!H:H,MATCH(146,VLC!V:V,0)),\"\"),\"\"),\"\")","v":""},{"$f":"_xlfn.IFNA(IF(INDEX(VLC!I:I,MATCH(106,VLC!V:V,0))<>\"\",_xlfn.IFNA(INDEX(VLC!I:I,MATCH(106,VLC!V:V,0)),\"\"),\"\"),\"\")","v":""},{"$f":"_xlfn.IFNA(IF(INDEX(VLC!I:I,MATCH(146,VLC!V:V,0))<>\"\",_xlfn.IFNA(INDEX(VLC!I:I,MATCH(146,VLC!V:V,0)),\"\"),\"\"),\"\")","v":""},{"$f":"_xlfn.IFNA(IF(INDEX(VLC!J:J,MATCH(106,VLC!V:V,0))=\"x\",_xlfn.IFNA(INDEX(VLC!J:J,MATCH(106,VLC!V:V,0)),\"\"),\"\"),\"\")","v":""},{"$f":"_xlfn.IFNA(IF(INDEX(VLC!J:J,MATCH(146,VLC!V:V,0))=\"x\",_xlfn.IFNA(INDEX(VLC!J:J,MATCH(146,VLC!V:V,0)),\"\"),\"\"),\"\")","v":""},1006,1046]
["SK Teilnehmer 7",{"$f":"_xlfn.IFNA(INDEX(VLC!A:A,MATCH(107,VLC!V:V,0)),\"\")","v":""},{"$f":"_xlfn.IFNA(INDEX(VLC!A:A,MATCH(147,VLC!V:V,0)),\"\")","v":""},{"$f":"_xlfn.IFNA(INDEX(VLC!B:B,MATCH(107,VLC!V:V,0)),\"\")","v":""},{"$f":"_xlfn.IFNA(INDEX(VLC!C:C,MATCH(107,VLC!V:V,0)),\"\")","v":""},{"$f":"_xlfn.IFNA(IF(INDEX(VLC!H:H,MATCH(107,VLC!V:V,0))=\"x\",_xlfn.IFNA(INDEX(VLC!H:H,MATCH(107,VLC!V:V,0)),\"\"),\"\"),\"\")","v":""},{"$f":"_xlfn.IFNA(IF(INDEX(VLC!H:H,MATCH(147,VLC!V:V,0))=\"x\",_xlfn.IFNA(INDEX(VLC!H:H,MATCH(147,VLC!V:V,0)),\"\"),\"\"),\"\")","v":""},{"$f":"_xlfn.IFNA(IF(INDEX(VLC!I:I,MATCH(107,VLC!V:V,0))<>\"\",_xlfn.IFNA(INDEX(VLC!I:I,MATCH(107,VLC!V:V,0)),\"\"),\"\"),\"\")","v":""},{"$f":"_xlfn.IFNA(IF(INDEX(VLC!I:I,MATCH(147,VLC!V:V,0))<>\"\",_xlfn.IFNA(INDEX(VLC!I:I,MATCH(147,VLC!V:V,0)),\"\"),\"\"),\"\")","v":""},{"$f":"_xlfn.IFNA(IF(INDEX(VLC!J:J,MATCH(107,VLC!V:V,0))=\"x\",_xlfn.IFNA(INDEX(VLC!J:J,MATCH(107,VLC!V:V,0)),\"\"),\"\"),\"\")","v":""},{"$f":"_xlfn.IFNA(IF(INDEX(VLC!J:J,MATCH(147,VLC!V:V,0))=\"x\",_xlfn.IFNA(INDEX(VLC!J:J,MATCH(147,VLC!V:V,0)),\"\"),\"\"),\"\")","v":""},1007,1047]
["SK Teilnehmer 8",{"$f":"_xlfn.IFNA(INDEX(VLC!A:A,MATCH(108,VLC!V:V,0)),\"\")","v":""},{"$f":"_xlfn.IFNA(INDEX(VLC!A:A,MATCH(148,VLC!V:V,0)),\"\")","v":""},{"$f":"_xlfn.IFNA(INDEX(VLC!B:B,MATCH(108,VLC!V:V,0)),\"\")","v":""},{"$f":"_xlfn.IFNA(INDEX(VLC!C:C,MATCH(108,VLC!V:V,0)),\"\")","v":""},{"$f":"_xlfn.IFNA(IF(INDEX(VLC!H:H,MATCH(108,VLC!V:V,0))=\"x\",_xlfn.IFNA(INDEX(VLC!H:H,MATCH(108,VLC!V:V,0)),\"\"),\"\"),\"\")","v":""},{"$f":"_xlfn.IFNA(IF(INDEX(VLC!H:H,MATCH(148,VLC!V:V,0))=\"x\",_xlfn.IFNA(INDEX(VLC!H:H,MATCH(148,VLC!V:V,0)),\"\"),\"\"),\"\")","v":""},{"$f":"_xlfn.IFNA(IF(INDEX(VLC!I:I,MATCH(108,VLC!V:V,0))<>\"\",_xlfn.IFNA(INDEX(VLC!I:I,MATCH(108,VLC!V:V,0)),\"\"),\"\"),\"\")","v":""},{"$f":"_xlfn.IFNA(IF(INDEX(VLC!I:I,MATCH(148,VLC!V:V,0))<>\"\",_xlfn.IFNA(INDEX(VLC!I:I,MATCH(148,VLC!V:V,0)),\"\"),\"\"),\"\")","v":""},{"$f":"_xlfn.IFNA(IF(INDEX(VLC!J:J,MATCH(108,VLC!V:V,0))=\"x\",_xlfn.IFNA(INDEX(VLC!J:J,MATCH(108,VLC!V:V,0)),\"\"),\"\"),\"\")","v":""},{"$f":"_xlfn.IFNA(IF(INDEX(VLC!J:J,MATCH(148,VLC!V:V,0))=\"x\",_xlfn.IFNA(INDEX(VLC!J:J,MATCH(148,VLC!V:V,0)),\"\"),\"\"),\"\")","v":""},1008,1048]
["SK Teilnehmer 9",{"$f":"_xlfn.IFNA(INDEX(VLC!A:A,MATCH(109,VLC!V:V,0)),\"\")","v":""},{"$f":"_xlfn.IFNA(INDEX(VLC!A:A,MATCH(149,VLC!V:V,0)),\"\")","v":""},{"$f":"_xlfn.IFNA(INDEX(VLC!B:B,MATCH(109,VLC!V:V,0)),\"\")","v":""},{"$f":"_xlfn.IFNA(INDEX(VLC!C:C,MATCH(109,VLC!V:V,0)),\"\")","v":""},{"$f":"_xlfn.IFNA(IF(INDEX(VLC!H:H,MATCH(109,VLC!V:V,0))=\"x\",_xlfn.IFNA(INDEX(VLC!H:H,MATCH(109,VLC!V:V,0)),\"\"),\"\"),\"\")","v":""},{"$f":"_xlfn.IFNA(IF(INDEX(VLC!H:H,MATCH(149,VLC!V:V,0))=\"x\",_xlfn.IFNA(INDEX(VLC!H:H,MATCH(149,VLC!V:V,0)),\"\"),\"\"),\"\")","v":""},{"$f":"_xlfn.IFNA(IF(INDEX(VLC!I:I,MATCH(109,VLC!V:V,0))<>\"\",_xlfn.IFNA(INDEX(VLC!I:I,MATCH(109,VLC!V:V,0)),\"\"),\"\"),\"\")","v":""},{"$f":"_xlfn.IFNA(IF(INDEX(VLC!I:I,MATCH(149,VLC!V:V,0))<>\"\",_xlfn.IFNA(INDEX(VLC!I:I,MATCH(149,VLC!V:V,0)),\"\"),\"\"),\"\")","v":""},{"$f":"_xlfn.IFNA(IF(INDEX(VLC!J:J,MATCH(109,VLC!V:V,0))=\"x\",_xlfn.IFNA(INDEX(VLC!J:J,MATCH(109,VLC!V:V,0)),\"\"),\"\"),\"\")","v":""},{"$f":"_xlfn.IFNA(IF(INDEX(VLC!J:J,MATCH(149,VLC!V:V,0))=\"x\",_xlfn.IFNA(INDEX(VLC!J:J,MATCH(149,VLC!V:V,0)),\"\"),\"\"),\"\")","v":""},1009,1049]
["SK Teilnehmer 10",{"$f":"_xlfn.IFNA(INDEX(VLC!A:A,MATCH(110,VLC!V:V,0)),\"\")","v":""},{"$f":"_xlfn.IFNA(INDEX(VLC!A:A,MATCH(150,VLC!V:V,0)),\"\")","v":""},{"$f":"_xlfn.IFNA(INDEX(VLC!B:B,MATCH(110,VLC!V:V,0)),\"\")","v":""},{"$f":"_xlfn.IFNA(INDEX(VLC!C:C,MATCH(110,VLC!V:V,0)),\"\")","v":""},{"$f":"_xlfn.IFNA(IF(INDEX(VLC!H:H,MATCH(110,VLC!V:V,0))=\"x\",_xlfn.IFNA(INDEX(VLC!H:H,MATCH(110,VLC!V:V,0)),\"\"),\"\"),\"\")","v":""},{"$f":"_xlfn.IFNA(IF(INDEX(VLC!H:H,MATCH(150,VLC!V:V,0))=\"x\",_xlfn.IFNA(INDEX(VLC!H:H,MATCH(150,VLC!V:V,0)),\"\"),\"\"),\"\")","v":""},{"$f":"_xlfn.IFNA(IF(INDEX(VLC!I:I,MATCH(110,VLC!V:V,0))<>\"\",_xlfn.IFNA(INDEX(VLC!I:I,MATCH(110,VLC!V:V,0)),\"\"),\"\"),\"\")","v":""},{"$f":"_xlfn.IFNA(IF(INDEX(VLC!I:I,MATCH(150,VLC!V:V,0))<>\"\",_xlfn.IFNA(INDEX(VLC!I:I,MATCH(150,VLC!V:V,0)),\"\"),\"\"),\"\")","v":""},{"$f":"_xlfn.IFNA(IF(INDEX(VLC!J:J,MATCH(110,VLC!V:V,0))=\"x\",_xlfn.IFNA(INDEX(VLC!J:J,MATCH(110,VLC!V:V,0)),\"\"),\"\"),\"\")","v":""},{"$f":"_xlfn.IFNA(IF(INDEX(VLC!J:J,MATCH(150,VLC!V:V,0))=\"x\",_xlfn.IFNA(INDEX(VLC!J:J,MATCH(150,VLC!V:V,0)),\"\"),\"\"),\"\")","v":""},1010,1050]
["SK Teilnehmer 11",{"$f":"_xlfn.IFNA(INDEX(VLC!A:A,MATCH(111,VLC!V:V,0)),\"\")","v":""},{"$f":"_xlfn.IFNA(INDEX(VLC!A:A,MATCH(151,VLC!V:V,0)),\"\")","v":""},{"$f":"_xlfn.IFNA(INDEX(VLC!B:B,MATCH(111,VLC!V:V,0)),\"\")","v":""},{"$f":"_xlfn.IFNA(INDEX(VLC!C:C,MATCH(111,VLC!V:V,0)),\"\")","v":""},{"$f":"_xlfn.IFNA(IF(INDEX(VLC!H:H,MATCH(111,VLC!V:V,0))=\"x\",_xlfn.IFNA(INDEX(VLC!H:H,MATCH(111,VLC!V:V,0)),\"\"),\"\"),\"\")","v":""},{"$f":"_xlfn.IFNA(IF(INDEX(VLC!H:H,MATCH(151,VLC!V:V,0))=\"x\",_xlfn.IFNA(INDEX(VLC!H:H,MATCH(151,VLC!V:V,0)),\"\"),\"\"),\"\")","v":""},{"$f":"_xlfn.IFNA(IF(INDEX(VLC!I:I,MATCH(111,VLC!V:V,0))<>\"\",_xlfn.IFNA(INDEX(VLC!I:I,MATCH(111,VLC!V:V,0)),\"\"),\"\"),\"\")","v":""},{"$f":"_xlfn.IFNA(IF(INDEX(VLC!I:I,MATCH(151,VLC!V:V,0))<>\"\",_xlfn.IFNA(INDEX(VLC!I:I,MATCH(151,VLC!V:V,0)),\"\"),\"\"),\"\")","v":""},{"$f":"_xlfn.IFNA(IF(INDEX(VLC!J:J,MATCH(111,VLC!V:V,0))=\"x\",_xlfn.IFNA(INDEX(VLC!J:J,MATCH(111,VLC!V:V,0)),\"\"),\"\"),\"\")","v":""},{"$f":"_xlfn.IFNA(IF(INDEX(VLC!J:J,MATCH(151,VLC!V:V,0))=\"x\",_xlfn.IFNA(INDEX(VLC!J:J,MATCH(151,VLC!V:V,0)),\"\"),\"\"),\"\")","v":""},1011,1051]
{"$rows_left_out":370}
{"sheet":"CB32","index":2,"n_rows":143,"n_cols":5,"rows_kept":143,"cut":false,"hidden":true,"merged":[[140,3,140,4],[141,3,141,4],[142,3,142,4],[134,3,134,4],[135,3,135,4],[136,3,136,4],[137,3,137,4],[138,3,138,4],[139,3,139,4],[128,3,128,4],[129,3,129,4],[130,3,130,4],[131,3,131,4],[132,3,132,4],[133,3,133,4],[122,3,122,4],[123,3,123,4],[124,3,124,4],[125,3,125,4],[126,3,126,4],[127,3,127,4],[116,3,116,4],[117,3,117,4],[118,3,118,4],[119,3,119,4],[120,3,120,4],[121,3,121,4],[110,3,110,4],[111,3,111,4],[112,3,112,4],[113,3,113,4],[114,3,114,4],[115,3,115,4],[104,3,104,4],[105,3,105,4],[106,3,106,4],[107,3,107,4],[108,3,108,4],[109,3,109,4],[98,3,98,4],[99,3,99,4],[100,3,100,4],[101,3,101,4],[102,3,102,4],[103,3,103,4],[92,3,92,4],[93,3,93,4],[94,3,94,4],[95,3,95,4],[96,3,96,4],[97,3,97,4],[86,3,86,4],[87,3,87,4],[88,3,88,4],[89,3,89,4],[90,3,90,4],[91,3,91,4],[80,3,80,4],[81,3,81,4],[82,3,82,4],[83,3,83,4],[84,3,84,4],[85,3,85,4],[74,3,74,4],[75,3,75,4],[76,3,76,4],[77,3,77,4],[78,3,78,4],[79,3,79,4],[68,3,68,4],[69,3,69,4],[70,3,70,4],[71,3,71,4],[72,3,72,4],[73,3,73,4],[62,3,62,4],[63,3,63,4],[64,3,64,4],[65,3,65,4],[66,3,66,4],[67,3,67,4],[56,3,56,4],[57,3,57,4],[58,3,58,4],[59,3,59,4],[60,3,60,4],[61,3,61,4],[50,3,50,4],[51,3,51,4],[52,3,52,4],[53,3,53,4],[54,3,54,4],[55,3,55,4],[44,3,44,4],[45,3,45,4],[46,3,46,4],[47,3,47,4],[48,3,48,4],[49,3,49,4],[0,3,0,4],[2,3,2,4],[3,3,3,4],[41,3,41,4],[42,3,42,4],[43,3,43,4],[34,3,34,4],[35,3,35,4],[36,3,36,4],[37,3,37,4],[40,3,40,4],[39,3,39,4],[38,3,38,4],[28,3,28,4],[29,3,29,4],[30,3,30,4],[31,3,31,4],[32,3,32,4],[33,3,33,4],[22,3,22,4],[23,3,23,4],[24,3,24,4],[25,3,25,4],[26,3,26,4],[27,3,27,4],[17,3,17,4],[18,3,18,4],[19,3,19,4],[20,3,20,4],[21,3,21,4],[11,3,11,4],[12,3,12,4],[13,3,13,4],[14,3,14,4],[15,3,15,4],[16,3,16,4],[5,3,5,4],[6,3,6,4],[7,3,7,4],[8,3,8,4],[9,3,9,4],[10,3,10,4]]}
["Bauvorhaben / Anlage: ",null,"ELEKTRO-Unternehmen :"]
[]
["verantwortlicher Monteur: "]
["externer Bus Nummer: 1"]
["Bezeichnung:"," "," ","Version","5.0"]
["Busbelegung","ID","Bezeichnung","Zusatzinfo"]
["Bus Teilnehmer 1"]
["Bus Teilnehmer 2"]
["Bus Teilnehmer 3"]
["Bus Teilnehmer 4"]
["Bus Teilnehmer 5"]
["Bus Teilnehmer 6"]
["Bus Teilnehmer 7"]
["Bus Teilnehmer 8"]
["Bus Teilnehmer 9"]
["Bus Teilnehmer 10"]
["Bus Teilnehmer 11"]
["Bus Teilnehmer 12"]
["Bus Teilnehmer 13"]
["Bus Teilnehmer 14"]
{"$rows_left_out":124}
{"sheet":"VLC","index":3,"n_rows":360,"n_cols":25,"rows_kept":360,"cut":false,"hidden":false,"merged":[]}
["Leuchten-ID","Bezeichnung","Zusatzinfo",null,null,"Stromkreis","Adresse","DL","GL","BL","Stromkreis","Adresse",null,null,null,"autozuweisung","Manuelle Adresse(max.1-20)","manuelle Zuweisung",null,"Adressen öfter vergeben",null,"Adresse für Sheet"]
[null,null,null,null,null,null,null,null,null,null,{"$f":"IFERROR(VALUE(RIGHT(F2,LEN(F2)-2)),\"\")","v":""},{"$f":"IFERROR(VALUE(RIGHT(G2,2)),\"\")","v":""},null,{"$f":"ISNUMBER(L2)","v":false},{"$f":"VALUE(IF(N2, L2, RIGHT(G2,1)))","v":{"$error":"#VALUE!"}},{"$f":"K2*100+O2","v":{"$error":"#VALUE!"}},null,{"$f":"IF(Q2=\"\",\"\",IFERROR(Q2+100*K2,\"\"))","v":""},{"$f":"COUNTIF(R:R,VALUE(R2))","v":0},{"$f":"IF(S2>1, 1, 0)","v":0},{"$f":"IF(Q2=\"\",COUNTIF(R:R,P2),0)","v":0},{"$f":"IFERROR(VALUE(IF(R2=\"\",P2,R2)),\"\")","v":""},{"$f":"COUNTIF(A:A,A2)","v":0},{"$f":"IFERROR(LEN(V2),\"\")","v":0},{"$f":"IF(X2=3,COUNTIF(V:V,V2),0)","v":0}]
[null,null,null,null,null,null,null,null,null,null,"","",null,{"$f":"ISNUMBER(L3)","v":false},{"$error":"#VALUE!"},{"$f":"K3*100+O3","v":{"$error":"#VALUE!"}},null,{"$f":"IF(Q3=\"\",\"\",IFERROR(Q3+100*K3,\"\"))","v":""},{"$f":"COUNTIF(R:R,VALUE(R3))","v":0},{"$f":"IF(S3>1, 1, 0)","v":0},{"$f":"IF(Q3=\"\",COUNTIF(R:R,P3),0)","v":0},"",0,{"$f":"IFERROR(LEN(V3),\"\")","v":0},{"$f":"IF(X3=3,COUNTIF(V:V,V3),0)","v":0}]
[null,null,null,null,null,null,null,null,null,null,"","",null,false,{"$error":"#VALUE!"},{"$error":"#VALUE!"},null,{"$f":"IF(Q4=\"\",\"\",IFERROR(Q4+100*K4,\"\"))","v":""},{"$f":"COUNTIF(R:R,VALUE(R4))","v":0},{"$f":"IF(S4>1, 1, 0)","v":0},{"$f":"IF(Q4=\"\",COUNTIF(R:R,P4),0)","v":0},"",0,{"$f":"IFERROR(LEN(V4),\"\")","v":0},{"$f":"IF(X4=3,COUNTIF(V:V,V4),0)","v":0}]
[null,null,null,null,null,null,null,null,null,null,"","",null,false,{"$error":"#VALUE!"},{"$error":"#VALUE!"},null,{"$f":"IF(Q5=\"\",\"\",IFERROR(Q5+100*K5,\"\"))","v":""},{"$f":"COUNTIF(R:R,VALUE(R5))","v":0},{"$f":"IF(S5>1, 1, 0)","v":0},{"$f":"IF(Q5=\"\",COUNTIF(R:R,P5),0)","v":0},"",0,{"$f":"IFERROR(LEN(V5),\"\")","v":0},{"$f":"IF(X5=3,COUNTIF(V:V,V5),0)","v":0}]
[null,null,null,null,null,null,null,null,null,null,"","",null,{"$f":"ISNUMBER(L6)","v":false},{"$error":"#VALUE!"},{"$f":"K6*100+O6","v":{"$error":"#VALUE!"}},null,"",{"$f":"COUNTIF(R:R,VALUE(R6))","v":0},{"$f":"IF(S6>1, 1, 0)","v":0},{"$f":"IF(Q6=\"\",COUNTIF(R:R,P6),0)","v":0},"",0,{"$f":"IFERROR(LEN(V6),\"\")","v":0},{"$f":"IF(X6=3,COUNTIF(V:V,V6),0)","v":0}]
[null,null,null,null,null,null,null,null,null,null,"","",null,false,{"$error":"#VALUE!"},{"$error":"#VALUE!"},null,"",0,0,0,"",0,0,0]
[null,null,null,null,null,null,null,null,null,null,"","",null,false,{"$error":"#VALUE!"},{"$error":"#VALUE!"},null,"",0,0,0,"",0,0,0]
[null,null,null,null,null,null,null,null,null,null,"","",null,false,{"$error":"#VALUE!"},{"$error":"#VALUE!"},null,"",0,0,0,"",0,0,0]
[null,null,null,null,null,null,null,null,null,null,"","",null,false,{"$error":"#VALUE!"},{"$error":"#VALUE!"},null,"",0,0,0,"",0,0,0]
[null,null,null,null,null,null,null,null,null,null,"","",null,false,{"$error":"#VALUE!"},{"$error":"#VALUE!"},null,"",0,0,0,"",0,0,0]
[null,null,null,null,null,null,null,null,null,null,"","",null,false,{"$error":"#VALUE!"},{"$error":"#VALUE!"},null,"",0,0,0,"",0,0,0]
[null,null,null,null,null,null,null,null,null,null,"","",null,false,{"$error":"#VALUE!"},{"$error":"#VALUE!"},null,"",0,0,0,"",0,0,0]
[null,null,null,null,null,null,null,null,null,null,"","",null,false,{"$error":"#VALUE!"},{"$error":"#VALUE!"},null,"",0,0,0,"",0,0,0]
[null,null,null,null,null,null,null,null,null,null,"","",null,false,{"$error":"#VALUE!"},{"$error":"#VALUE!"},null,"",0,0,0,"",0,0,0]
[null,null,null,null,null,null,null,null,null,null,"","",null,false,{"$error":"#VALUE!"},{"$error":"#VALUE!"},null,"",0,0,0,"",0,0,0]
[null,null,null,null,null,null,null,null,null,null,"","",null,false,{"$error":"#VALUE!"},{"$error":"#VALUE!"},null,"",{"$f":"COUNTIF(R:R,VALUE(R17))","v":0},{"$f":"IF(S17>1, 1, 0)","v":0},{"$f":"IF(Q17=\"\",COUNTIF(R:R,P17),0)","v":0},"",0,{"$f":"IFERROR(LEN(V17),\"\")","v":0},{"$f":"IF(X17=3,COUNTIF(V:V,V17),0)","v":0}]
[null,null,null,null,null,null,null,null,null,null,"","",null,false,{"$error":"#VALUE!"},{"$error":"#VALUE!"},null,"",0,0,0,"",0,0,0]
[null,null,null,null,null,null,null,null,null,null,"","",null,false,{"$error":"#VALUE!"},{"$error":"#VALUE!"},null,"",0,0,0,"",0,0,0]
[null,null,null,null,null,null,null,null,null,null,"","",null,false,{"$error":"#VALUE!"},{"$error":"#VALUE!"},null,"",0,0,0,"",0,0,0]
{"$rows_left_out":341}
{"sheet":"Step by step guide","index":4,"n_rows":44,"n_cols":5,"rows_kept":44,"cut":false,"hidden":false,"merged":[]}
["1)","Wechsel in die \"VLC\" Tabelle."]
["2)","Wähle die Zelle A2 aus."]
["3)","Nun kann mittels VLC Sensor die Adresse der Leuchte augelesen werden."]
["4)","Die Spalten \"Bezeichnung\" und \"Zusatzinfo\" können beliebig befüllt werden. Achtung: Die maximale Zeichenanzahl für \"Bezeichnung\" beträgt 100 Zeichen und für \"Zusatzinfo\" 1000 Zeichen und dürfen nicht überschritten werden."]
["5)","In den Spalten DL bzw BL  kann mittels eines \"x\"  entweder Dauer oder Bereitschaftslicht ausgewählt werden. Bei GL kannst du Eingänge wählen mit welchen das Licht geschaltet werden soll."]
["6)","Sollte die automatische Adresse falsch sein kann diese in der Spalte manuelle Adresse überschrieben werden. Bei Duo-Leuchten wird die zweite Adresse automatisch mit geändert."]
[null,"Wenn kein Eintrag in der manuellen Adresse vorhanden ist wird die automatisch vergebene als Adresse der jeweiligen Leuchte genommen."]
["7)","Nach fertiger Konfiguration der Leuchte (Bezeichnung, Zusatzinfo, DL/BL/GL, manuelle Adressvergabe ja/nein) muss der Cursor in die nächste A-Zeile gesetzt werden."]
["8)","Wiederhole die Schritte 3 bis 7 bis alle Leuchten eingetragen sind."]
["9)","Da die Leuchtenliste Makros enthält ist es wichtig sie immer als .xslm Datei abzuspeichern."]
[]
["Generelle Informationen:"]
[null,"Sobald eine Leuchte fertig konfiguriert ist in der \"VLC\" Tabelle wird sie automatisch in der \"PLC24\" Tabelle richtig eingereiht."]
[]
["Farbcode:",null,"färbt sich ein Feld, in der Spalte \"manuelle Adresse\" rot bzw. Zellen in der \"Stromkreis\"Spalte orange bedeutet dies, dass durch die manuelle Adressvergabe eine Doppeladressierung erfolgt ist."]
[null,null,"Die rote Zelle gibt in diesem Fall direkt an welche automatische Adresse manuell noch überschrieben werden muss um wieder einzigartige Adressierung zu gewährleisten."]
[]
[null,null,"Behebung: Ausfüllen der roten Zelle mit einer noch nicht vergebenen Adresse im jeweiligen Stromkreis."]
[]
[null,null,"Der Zweite Fall ist ein rotes Feld in der \"Leuchten ID\" Spalte, dies bedeutet dass diese ID bereits vergeben ist."]
{"$rows_left_out":24}